BDBM50404296 CHEMBL8029
SMILES: Clc1cccc(NC(NC(Cn2ccnc2)c2ccc(Cl)cc2Cl)=NC#N)c1
InChI Key: InChIKey=JWCDMFSLLGMXNN-UHFFFAOYSA-N
Data: 2 IC50
Activity Spreadsheet -- Enzyme Inhibition Constant Data from BindingDB
Found 2 hits for monomerid = 50404296
Trg + Lig
Ki
nM
ΔG°
kcal/mole
IC50
nM
Kd
nM
EC50/IC50
nM
koff
s-1
kon
M-1s-1
pHTemp
°C
Mitochondrial complex V; ATP synthase
(Bos taurus)
BDBM50404296
(CHEMBL8029)
Show SMILES Clc1cccc(NC(NC(Cn2ccnc2)c2ccc(Cl)cc2Cl)=NC#N)c1 |w:24.26|
Show InChI InChI=1S/C19H15Cl3N6/c20-13-2-1-3-15(8-13)26-19(25-11-23)27-18(10-28-7-6-24-12-28)16-5-4-14(21)9-17(16)22/h1-9,12,18H,10H2,(H2,25,26,27)
n/an/a 9.17E+3n/an/an/an/an/an/a
Pharmaceutical Research Institute
Curated by ChEMBL
Assay Description
Inhibitory activity against bovine mitochondrial F1F0-ATP synthase
Bioorg Med Chem Lett 14: 1027-30 (2004)
Article DOI: 10.1016/j.bmcl.2003.11.077
BindingDB Entry DOI: 10.7270/Q2VX0HQ9
Mitochondrial complex V; ATP synthase
(Bos taurus)
BDBM50404296
(CHEMBL8029)
Show SMILES Clc1cccc(NC(NC(Cn2ccnc2)c2ccc(Cl)cc2Cl)=NC#N)c1 |w:24.26|
Show InChI InChI=1S/C19H15Cl3N6/c20-13-2-1-3-15(8-13)26-19(25-11-23)27-18(10-28-7-6-24-12-28)16-5-4-14(21)9-17(16)22/h1-9,12,18H,10H2,(H2,25,26,27)
n/an/a>1.00E+5n/an/an/an/an/an/a
Pharmaceutical Research Institute
Curated by ChEMBL
Assay Description
Inhibitory activity against bovine mitochondrial F1F0 ATP hydrolase
Bioorg Med Chem Lett 14: 1027-30 (2004)
Article DOI: 10.1016/j.bmcl.2003.11.077
BindingDB Entry DOI: 10.7270/Q2VX0HQ9