BDBM50404300 CHEMBL7894
SMILES: CCC(=O)C(NC(Cn1ccnc1)c1ccc(Cl)cc1Cl)Nc1ccc(Cl)cc1
InChI Key: InChIKey=XAQPOFUAMZOHGZ-UHFFFAOYSA-N
Data: 2 IC50
Activity Spreadsheet -- Enzyme Inhibition Constant Data from BindingDB
Found 2 hits for monomerid = 50404300
Trg + Lig
Ki
nM
ΔG°
kcal/mole
IC50
nM
Kd
nM
EC50/IC50
nM
koff
s-1
kon
M-1s-1
pHTemp
°C
Mitochondrial complex V; ATP synthase
(Bos taurus)
BDBM50404300
(CHEMBL7894)
Show SMILES CCC(=O)C(NC(Cn1ccnc1)c1ccc(Cl)cc1Cl)Nc1ccc(Cl)cc1
Show InChI InChI=1S/C21H21Cl3N4O/c1-2-20(29)21(26-16-6-3-14(22)4-7-16)27-19(12-28-10-9-25-13-28)17-8-5-15(23)11-18(17)24/h3-11,13,19,21,26-27H,2,12H2,1H3
n/an/a>1.00E+5n/an/an/an/an/an/a
Pharmaceutical Research Institute
Curated by ChEMBL
Assay Description
Inhibitory activity against bovine mitochondrial F1F0-ATP synthase
Bioorg Med Chem Lett 14: 1027-30 (2004)
Article DOI: 10.1016/j.bmcl.2003.11.077
BindingDB Entry DOI: 10.7270/Q2VX0HQ9
Mitochondrial complex V; ATP synthase
(Bos taurus)
BDBM50404300
(CHEMBL7894)
Show SMILES CCC(=O)C(NC(Cn1ccnc1)c1ccc(Cl)cc1Cl)Nc1ccc(Cl)cc1
Show InChI InChI=1S/C21H21Cl3N4O/c1-2-20(29)21(26-16-6-3-14(22)4-7-16)27-19(12-28-10-9-25-13-28)17-8-5-15(23)11-18(17)24/h3-11,13,19,21,26-27H,2,12H2,1H3
n/an/a 2.27E+3n/an/an/an/an/an/a
Pharmaceutical Research Institute
Curated by ChEMBL
Assay Description
Inhibitory activity against bovine mitochondrial F1F0 ATP hydrolase
Bioorg Med Chem Lett 14: 1027-30 (2004)
Article DOI: 10.1016/j.bmcl.2003.11.077
BindingDB Entry DOI: 10.7270/Q2VX0HQ9