BDBM50404319 CHEMBL266556
SMILES: FC(F)(F)S(=O)(=O)N1CC(CCc2ccccc2)N(Cc2cnc[nH]2)c2ccccc2C1
InChI Key: InChIKey=RTOXSJOYXMFDNR-UHFFFAOYSA-N
Data: 2 IC50
Activity Spreadsheet -- Enzyme Inhibition Constant Data from BindingDB
Found 2 hits for monomerid = 50404319
Trg + Lig
Ki
nM
ΔG°
kcal/mole
IC50
nM
Kd
nM
EC50/IC50
nM
koff
s-1
kon
M-1s-1
pHTemp
°C
Mitochondrial complex V; ATP synthase
(Bos taurus)
BDBM50404319
(CHEMBL266556)
Show SMILES FC(F)(F)S(=O)(=O)N1CC(CCc2ccccc2)N(Cc2cnc[nH]2)c2ccccc2C1
Show InChI InChI=1S/C22H23F3N4O2S/c23-22(24,25)32(30,31)28-13-18-8-4-5-9-21(18)29(14-19-12-26-16-27-19)20(15-28)11-10-17-6-2-1-3-7-17/h1-9,12,16,20H,10-11,13-15H2,(H,26,27)
n/an/a>3.00E+4n/an/an/an/an/an/a
Pharmaceutical Research Institute
Curated by ChEMBL
Assay Description
Inhibitory activity against bovine mitochondrial F1F0-ATP synthase
Bioorg Med Chem Lett 14: 1031-4 (2004)
Article DOI: 10.1016/j.bmcl.2003.11.052
BindingDB Entry DOI: 10.7270/Q2D50MCF
Mitochondrial complex V; ATP synthase
(Bos taurus)
BDBM50404319
(CHEMBL266556)
Show SMILES FC(F)(F)S(=O)(=O)N1CC(CCc2ccccc2)N(Cc2cnc[nH]2)c2ccccc2C1
Show InChI InChI=1S/C22H23F3N4O2S/c23-22(24,25)32(30,31)28-13-18-8-4-5-9-21(18)29(14-19-12-26-16-27-19)20(15-28)11-10-17-6-2-1-3-7-17/h1-9,12,16,20H,10-11,13-15H2,(H,26,27)
n/an/a 77n/an/an/an/an/an/a
Pharmaceutical Research Institute
Curated by ChEMBL
Assay Description
Inhibitory activity against bovine mitochondrial F1F0-ATP synthase
Bioorg Med Chem Lett 14: 1031-4 (2004)
Article DOI: 10.1016/j.bmcl.2003.11.052
BindingDB Entry DOI: 10.7270/Q2D50MCF