null
SMILES: CC1CCN(C(C1)C(O)=O)C(=O)C(CCCNC(N)=N)NS(=O)(=O)c1ccc2oc3ccccc3c2c1
InChI Key: InChIKey=UTLIPHKZGPIDBT-UHFFFAOYSA-N
Activity Spreadsheet -- Enzyme Inhibition Constant Data from BindingDB
Found 1 hit for monomerid = 50404409
Trg + Lig
Ki
nM
ΔG°
kcal/mole
IC50
nM
Kd
nM
EC50/IC50
nM
koff
s-1
kon
M-1s-1
pHTemp
°C
Prothrombin
(Bos taurus (Bovine))
BDBM50404409
(CHEMBL286515)
Show SMILES CC1CCN(C(C1)C(O)=O)C(=O)C(CCCNC(N)=N)NS(=O)(=O)c1ccc2oc3ccccc3c2c1
Show InChI InChI=1S/C25H31N5O6S/c1-15-10-12-30(20(13-15)24(32)33)23(31)19(6-4-11-28-25(26)27)29-37(34,35)16-8-9-22-18(14-16)17-5-2-3-7-21(17)36-22/h2-3,5,7-9,14-15,19-20,29H,4,6,10-13H2,1H3,(H,32,33)(H4,26,27,28)
n/an/a 100n/an/an/an/an/an/a
TBA
Curated by ChEMBL
Assay Description
Concentration at which the clotting time was prolonged by twice that of the control by inhibiting thrombin
J Med Chem 23: 1293-9 (1981)
BindingDB Entry DOI: 10.7270/Q2GQ6ZX5