BDBM50404846 CHEMBL311525
SMILES: C[C@H](CS)C(=O)N1[C@@H](CCC1=O)C(O)=O
InChI Key: InChIKey=ORFGPZNJDHOWLV-RITPCOANSA-N
Data: 2 IC50
Activity Spreadsheet -- Enzyme Inhibition Constant Data from BindingDB
Found 2 hits for monomerid = 50404846
Trg + Lig
Ki
nM
ΔG°
kcal/mole
IC50
nM
Kd
nM
EC50/IC50
nM
koff
s-1
kon
M-1s-1
pHTemp
°C
Angiotensin-converting enzyme
(Homo sapiens (Human))
BDBM50404846
(CHEMBL311525)
Show SMILES C[C@H](CS)C(=O)N1[C@@H](CCC1=O)C(O)=O
Show InChI InChI=1S/C9H13NO4S/c1-5(4-15)8(12)10-6(9(13)14)2-3-7(10)11/h5-6,15H,2-4H2,1H3,(H,13,14)/t5-,6+/m1/s1
Reactome pathway
n/an/a 8.90n/an/an/an/an/an/a
Washington University
Curated by ChEMBL
Assay Description
Inhibitory activity against angiotensin converting enzyme (ACE)
J Med Chem 36: 2390-403 (1993)
BindingDB Entry DOI: 10.7270/Q2Z320V9
Angiotensin-converting enzyme
(Oryctolagus cuniculus)
BDBM50404846
(CHEMBL311525)
Show SMILES C[C@H](CS)C(=O)N1[C@@H](CCC1=O)C(O)=O
Show InChI InChI=1S/C9H13NO4S/c1-5(4-15)8(12)10-6(9(13)14)2-3-7(10)11/h5-6,15H,2-4H2,1H3,(H,13,14)/t5-,6+/m1/s1
n/an/a 9n/an/an/an/an/an/a
TBA
Curated by ChEMBL
Assay Description
In vitro inhibitory activity against Angiotensin I converting enzyme in rabbit lung, using hippuryl-histidyl-leucine as substrate
J Med Chem 25: 250-8 (1982)
BindingDB Entry DOI: 10.7270/Q28053SJ