BDBM50404921 CHEMBL171191
SMILES: CCCCCCc1nc2ccccc2[nH]1
InChI Key: InChIKey=FINXTJFVUXNTOQ-UHFFFAOYSA-N
Data: 1 IC50
Activity Spreadsheet -- Enzyme Inhibition Constant Data from BindingDB
Found 1 hit for monomerid = 50404921
Trg + Lig
Ki
nM
ΔG°
kcal/mole
IC50
nM
Kd
nM
EC50/IC50
nM
koff
s-1
kon
M-1s-1
pHTemp
°C
Cytochrome P450 2B1
(Rattus norvegicus)
BDBM50404921
(CHEMBL171191)
Show SMILES CCCCCCc1nc2ccccc2[nH]1
Show InChI InChI=1S/C13H18N2/c1-2-3-4-5-10-13-14-11-8-6-7-9-12(11)15-13/h6-9H,2-5,10H2,1H3,(H,14,15)
n/an/a 3.24E+4n/an/an/an/an/an/a
TBA
Curated by ChEMBL
Assay Description
Inhibitory potency to aminopyrine N-demethylase activity (P450) in hepatic microsomes from phenobarbitone-induced rats.
J Med Chem 25: 887-92 (1982)
BindingDB Entry DOI: 10.7270/Q2VT1T8J