BDBM50405334 CHEMBL543454
SMILES: [#7]\[#6](-[#7])=[#7]\c1ccc(cc1)-[#6](=O)-[#8]-c1cccc2cccnc12
InChI Key: InChIKey=NMSDAYXPBQAAGR-UHFFFAOYSA-N
Data: 2 IC50
Activity Spreadsheet -- Enzyme Inhibition Constant Data from BindingDB
Found 2 hits for monomerid = 50405334
Trg + Lig
Ki
nM
ΔG°
kcal/mole
IC50
nM
Kd
nM
EC50/IC50
nM
koff
s-1
kon
M-1s-1
pHTemp
°C
Acrosin
(Homo sapiens (Human))
BDBM50405334
(CHEMBL543454)
Show SMILES [#7]\[#6](-[#7])=[#7]\c1ccc(cc1)-[#6](=O)-[#8]-c1cccc2cccnc12
Show InChI InChI=1S/C17H14N4O2/c18-17(19)21-13-8-6-12(7-9-13)16(22)23-14-5-1-3-11-4-2-10-20-15(11)14/h1-10H,(H4,18,19,21)
Reactome pathway
n/an/a 19.8n/an/an/an/an/an/a
TBA
Curated by ChEMBL
Assay Description
Inhibition of human acrosin and control activity being 11.3 umol/min/mg
J Med Chem 29: 514-9 (1986)
BindingDB Entry DOI: 10.7270/Q20C4WZ7
Trypsin-1
(Homo sapiens (Human))
BDBM50405334
(CHEMBL543454)
Show SMILES [#7]\[#6](-[#7])=[#7]\c1ccc(cc1)-[#6](=O)-[#8]-c1cccc2cccnc12
Show InChI InChI=1S/C17H14N4O2/c18-17(19)21-13-8-6-12(7-9-13)16(22)23-14-5-1-3-11-4-2-10-20-15(11)14/h1-10H,(H4,18,19,21)
Reactome pathway
n/an/a 27.7n/an/an/an/an/an/a
TBA
Curated by ChEMBL
Assay Description
Inhibition of human trypsin and the control activity being 7.3 umol/min/mg
J Med Chem 29: 514-9 (1986)
BindingDB Entry DOI: 10.7270/Q20C4WZ7