BDBM50405343 CHEMBL545564
SMILES: [#7]\[#6](-[#7])=[#7]\c1ccc(cc1)-[#6](=O)-[#8]-c1ccccc1-[#6](-[#7])=O
InChI Key: InChIKey=SSQXQXQTZWWUDB-UHFFFAOYSA-N
Data: 2 IC50
Activity Spreadsheet -- Enzyme Inhibition Constant Data from BindingDB
Found 2 hits for monomerid = 50405343
Trg + Lig
Ki
nM
ΔG°
kcal/mole
IC50
nM
Kd
nM
EC50/IC50
nM
koff
s-1
kon
M-1s-1
pHTemp
°C
Trypsin-1
(Homo sapiens (Human))
BDBM50405343
(CHEMBL545564)
Show SMILES [#7]\[#6](-[#7])=[#7]\c1ccc(cc1)-[#6](=O)-[#8]-c1ccccc1-[#6](-[#7])=O
Show InChI InChI=1S/C15H14N4O3/c16-13(20)11-3-1-2-4-12(11)22-14(21)9-5-7-10(8-6-9)19-15(17)18/h1-8H,(H2,16,20)(H4,17,18,19)
Reactome pathway
n/an/a 300n/an/an/an/an/an/a
TBA
Curated by ChEMBL
Assay Description
Inhibition of human trypsin and the control activity being 7.3 umol/min/mg
J Med Chem 29: 514-9 (1986)
BindingDB Entry DOI: 10.7270/Q20C4WZ7
Acrosin
(Homo sapiens (Human))
BDBM50405343
(CHEMBL545564)
Show SMILES [#7]\[#6](-[#7])=[#7]\c1ccc(cc1)-[#6](=O)-[#8]-c1ccccc1-[#6](-[#7])=O
Show InChI InChI=1S/C15H14N4O3/c16-13(20)11-3-1-2-4-12(11)22-14(21)9-5-7-10(8-6-9)19-15(17)18/h1-8H,(H2,16,20)(H4,17,18,19)
Reactome pathway
n/an/a 300n/an/an/an/an/an/a
TBA
Curated by ChEMBL
Assay Description
Inhibition of human acrosin and control activity being 11.3 umol/min/mg
J Med Chem 29: 514-9 (1986)
BindingDB Entry DOI: 10.7270/Q20C4WZ7