BDBM50405347 CHEMBL539058
SMILES: [#6]-[#6](=O)-[#7]-c1ccc(-[#8]-[#6](=O)-c2ccc(cc2)\[#7]=[#6](\[#7])-[#7])cc1
InChI Key: InChIKey=VACGBZYEDFQOIU-UHFFFAOYSA-N
Data: 2 IC50
Activity Spreadsheet -- Enzyme Inhibition Constant Data from BindingDB
Found 2 hits for monomerid = 50405347
Trg + Lig
Ki
nM
ΔG°
kcal/mole
IC50
nM
Kd
nM
EC50/IC50
nM
koff
s-1
kon
M-1s-1
pHTemp
°C
Acrosin
(Homo sapiens (Human))
BDBM50405347
(CHEMBL539058)
Show SMILES [#6]-[#6](=O)-[#7]-c1ccc(-[#8]-[#6](=O)-c2ccc(cc2)\[#7]=[#6](\[#7])-[#7])cc1
Show InChI InChI=1S/C16H16N4O3/c1-10(21)19-12-6-8-14(9-7-12)23-15(22)11-2-4-13(5-3-11)20-16(17)18/h2-9H,1H3,(H,19,21)(H4,17,18,20)
Reactome pathway
n/an/a 8n/an/an/an/an/an/a
TBA
Curated by ChEMBL
Assay Description
Inhibition of human acrosin and control activity being 11.3 umol/min/mg
J Med Chem 29: 514-9 (1986)
BindingDB Entry DOI: 10.7270/Q20C4WZ7
Trypsin-1
(Homo sapiens (Human))
BDBM50405347
(CHEMBL539058)
Show SMILES [#6]-[#6](=O)-[#7]-c1ccc(-[#8]-[#6](=O)-c2ccc(cc2)\[#7]=[#6](\[#7])-[#7])cc1
Show InChI InChI=1S/C16H16N4O3/c1-10(21)19-12-6-8-14(9-7-12)23-15(22)11-2-4-13(5-3-11)20-16(17)18/h2-9H,1H3,(H,19,21)(H4,17,18,20)
Reactome pathway
n/an/a 23.7n/an/an/an/an/an/a
TBA
Curated by ChEMBL
Assay Description
Inhibition of human trypsin and the control activity being 7.3 umol/min/mg
J Med Chem 29: 514-9 (1986)
BindingDB Entry DOI: 10.7270/Q20C4WZ7