BDBM50405349 CHEMBL148833
SMILES: [#6]-[#8]-c1ccccc1-[#8]-[#6](=O)-c1ccc(cc1)\[#7]=[#6](/[#7])-[#7]
InChI Key: InChIKey=DPXQMHQTGAAOQB-UHFFFAOYSA-N
Data: 2 IC50
Activity Spreadsheet -- Enzyme Inhibition Constant Data from BindingDB
Found 2 hits for monomerid = 50405349
Trg + Lig
Ki
nM
ΔG°
kcal/mole
IC50
nM
Kd
nM
EC50/IC50
nM
koff
s-1
kon
M-1s-1
pHTemp
°C
Acrosin
(Homo sapiens (Human))
BDBM50405349
(CHEMBL148833)
Show SMILES [#6]-[#8]-c1ccccc1-[#8]-[#6](=O)-c1ccc(cc1)\[#7]=[#6](/[#7])-[#7]
Show InChI InChI=1S/C15H15N3O3/c1-20-12-4-2-3-5-13(12)21-14(19)10-6-8-11(9-7-10)18-15(16)17/h2-9H,1H3,(H4,16,17,18)
Reactome pathway
n/an/a 27.3n/an/an/an/an/an/a
TBA
Curated by ChEMBL
Assay Description
Inhibition of human acrosin and control activity being 11.3 umol/min/mg
J Med Chem 29: 514-9 (1986)
BindingDB Entry DOI: 10.7270/Q20C4WZ7
Trypsin-1
(Homo sapiens (Human))
BDBM50405349
(CHEMBL148833)
Show SMILES [#6]-[#8]-c1ccccc1-[#8]-[#6](=O)-c1ccc(cc1)\[#7]=[#6](/[#7])-[#7]
Show InChI InChI=1S/C15H15N3O3/c1-20-12-4-2-3-5-13(12)21-14(19)10-6-8-11(9-7-10)18-15(16)17/h2-9H,1H3,(H4,16,17,18)
Reactome pathway
n/an/a 87.6n/an/an/an/an/an/a
TBA
Curated by ChEMBL
Assay Description
Inhibition of human trypsin and the control activity being 7.3 umol/min/mg
J Med Chem 29: 514-9 (1986)
BindingDB Entry DOI: 10.7270/Q20C4WZ7