BDBM50405350 CHEMBL151454
SMILES: [#6]-c1ccc(-[#8]-[#6](=O)-c2ccc(cc2)\[#7]=[#6](/[#7])-[#7])cc1
InChI Key: InChIKey=OELAPCOUDOSGBC-UHFFFAOYSA-N
Data: 2 IC50
Activity Spreadsheet -- Enzyme Inhibition Constant Data from BindingDB
Found 2 hits for monomerid = 50405350
Trg + Lig
Ki
nM
ΔG°
kcal/mole
IC50
nM
Kd
nM
EC50/IC50
nM
koff
s-1
kon
M-1s-1
pHTemp
°C
Acrosin
(Homo sapiens (Human))
BDBM50405350
(CHEMBL151454)
Show SMILES [#6]-c1ccc(-[#8]-[#6](=O)-c2ccc(cc2)\[#7]=[#6](/[#7])-[#7])cc1
Show InChI InChI=1S/C15H15N3O2/c1-10-2-8-13(9-3-10)20-14(19)11-4-6-12(7-5-11)18-15(16)17/h2-9H,1H3,(H4,16,17,18)
Reactome pathway
n/an/a 3.30n/an/an/an/an/an/a
TBA
Curated by ChEMBL
Assay Description
Inhibition of human acrosin and control activity being 11.3 umol/min/mg
J Med Chem 29: 514-9 (1986)
BindingDB Entry DOI: 10.7270/Q20C4WZ7
Trypsin-1
(Homo sapiens (Human))
BDBM50405350
(CHEMBL151454)
Show SMILES [#6]-c1ccc(-[#8]-[#6](=O)-c2ccc(cc2)\[#7]=[#6](/[#7])-[#7])cc1
Show InChI InChI=1S/C15H15N3O2/c1-10-2-8-13(9-3-10)20-14(19)11-4-6-12(7-5-11)18-15(16)17/h2-9H,1H3,(H4,16,17,18)
Reactome pathway
n/an/a 19.5n/an/an/an/an/an/a
TBA
Curated by ChEMBL
Assay Description
Inhibition of human trypsin and the control activity being 7.3 umol/min/mg
J Med Chem 29: 514-9 (1986)
BindingDB Entry DOI: 10.7270/Q20C4WZ7