BDBM50405352 CHEMBL149324
SMILES: [#7]\[#6](-[#7])=[#7]/c1ccc(cc1)-[#6](=O)-[#8]-c1ccccc1
InChI Key: InChIKey=PXPIXLVXGYQMFM-UHFFFAOYSA-N
Data: 2 IC50
Activity Spreadsheet -- Enzyme Inhibition Constant Data from BindingDB
Found 2 hits for monomerid = 50405352
Trg + Lig
Ki
nM
ΔG°
kcal/mole
IC50
nM
Kd
nM
EC50/IC50
nM
koff
s-1
kon
M-1s-1
pHTemp
°C
Trypsin-1
(Homo sapiens (Human))
BDBM50405352
(CHEMBL149324)
Show SMILES [#7]\[#6](-[#7])=[#7]/c1ccc(cc1)-[#6](=O)-[#8]-c1ccccc1
Show InChI InChI=1S/C14H13N3O2/c15-14(16)17-11-8-6-10(7-9-11)13(18)19-12-4-2-1-3-5-12/h1-9H,(H4,15,16,17)
Reactome pathway
n/an/a 23.4n/an/an/an/an/an/a
TBA
Curated by ChEMBL
Assay Description
Inhibition of human trypsin and the control activity being 7.3 umol/min/mg
J Med Chem 29: 514-9 (1986)
BindingDB Entry DOI: 10.7270/Q20C4WZ7
Acrosin
(Homo sapiens (Human))
BDBM50405352
(CHEMBL149324)
Show SMILES [#7]\[#6](-[#7])=[#7]/c1ccc(cc1)-[#6](=O)-[#8]-c1ccccc1
Show InChI InChI=1S/C14H13N3O2/c15-14(16)17-11-8-6-10(7-9-11)13(18)19-12-4-2-1-3-5-12/h1-9H,(H4,15,16,17)
Reactome pathway
n/an/a 5.60n/an/an/an/an/an/a
TBA
Curated by ChEMBL
Assay Description
Inhibition of human acrosin and control activity being 11.3 umol/min/mg
J Med Chem 29: 514-9 (1986)
BindingDB Entry DOI: 10.7270/Q20C4WZ7