BDBM50405517 CHEMBL543717
SMILES: CC(CC#N)NCC(O)COc1ccc(CCOCC2CCC2)cc1
InChI Key: InChIKey=GQBZOBXTYCGAGK-UHFFFAOYSA-N
Data: 1 Kd
Activity Spreadsheet -- Enzyme Inhibition Constant Data from BindingDB
Found 1 hit for monomerid = 50405517
Trg + Lig
Ki
nM
ΔG°
kcal/mole
IC50
nM
Kd
nM
EC50/IC50
nM
koff
s-1
kon
M-1s-1
pHTemp
°C
Beta-1 adrenergic receptor
(Rattus norvegicus (Rat))
BDBM50405517
(CHEMBL543717)
Show SMILES CC(CC#N)NCC(O)COc1ccc(CCOCC2CCC2)cc1
Show InChI InChI=1S/C20H30N2O3/c1-16(9-11-21)22-13-19(23)15-25-20-7-5-17(6-8-20)10-12-24-14-18-3-2-4-18/h5-8,16,18-19,22-23H,2-4,9-10,12-15H2,1H3
Reactome pathway
n/an/an/a 339n/an/an/an/an/a
TBA
Curated by ChEMBL
Assay Description
Antagonist activity was determined against beta-1 adrenergic receptor in spontaneously beating rat atria
J Med Chem 30: 1003-11 (1987)
BindingDB Entry DOI: 10.7270/Q2251KC9