null
SMILES: CC(=O)NCCNCC(O)COc1ccc(CCOCC2CCC2)cc1
InChI Key: InChIKey=GEZKVCIBJRRJNL-UHFFFAOYSA-N
Activity Spreadsheet -- Enzyme Inhibition Constant Data from BindingDB
Found 1 hit for monomerid = 50405524
Trg + Lig
Ki
nM
ΔG°
kcal/mole
IC50
nM
Kd
nM
EC50/IC50
nM
koff
s-1
kon
M-1s-1
pHTemp
°C
Beta-1 adrenergic receptor
(Rattus norvegicus (Rat))
BDBM50405524
(CHEMBL543484)
Show SMILES CC(=O)NCCNCC(O)COc1ccc(CCOCC2CCC2)cc1
Show InChI InChI=1S/C20H32N2O4/c1-16(23)22-11-10-21-13-19(24)15-26-20-7-5-17(6-8-20)9-12-25-14-18-3-2-4-18/h5-8,18-19,21,24H,2-4,9-15H2,1H3,(H,22,23)
Reactome pathway
n/an/an/a 61.7n/an/an/an/an/a
TBA
Curated by ChEMBL
Assay Description
Antagonist activity was determined against beta-1 adrenergic receptor in spontaneously beating rat atria
J Med Chem 30: 1003-11 (1987)
BindingDB Entry DOI: 10.7270/Q2251KC9