BDBM50405757 CHEMBL168786
SMILES: COc1ccccc1CNCCCCCCNCCCCCCCCCCCCCNCCCCCCNCc1ccccc1OC
InChI Key: InChIKey=FLSBKMJNAWVMIT-UHFFFAOYSA-N
Data: 2 Kd
Activity Spreadsheet -- Enzyme Inhibition Constant Data from BindingDB
Found 2 hits for monomerid = 50405757
Trg + Lig
Ki
nM
ΔG°
kcal/mole
IC50
nM
Kd
nM
EC50/IC50
nM
koff
s-1
kon
M-1s-1
pHTemp
°C
Muscarinic acetylcholine receptor M2
(Homo sapiens (Human))
BDBM50405757
(CHEMBL168786)
Show SMILES COc1ccccc1CNCCCCCCNCCCCCCCCCCCCCNCCCCCCNCc1ccccc1OC
Show InChI InChI=1S/C41H72N4O2/c1-46-40-28-18-16-26-38(40)36-44-34-24-14-12-22-32-42-30-20-10-8-6-4-3-5-7-9-11-21-31-43-33-23-13-15-25-35-45-37-39-27-17-19-29-41(39)47-2/h16-19,26-29,42-45H,3-15,20-25,30-37H2,1-2H3
n/an/an/a 95.5n/an/an/an/an/a
University of Camerino
Curated by ChEMBL
Assay Description
Antagonist potency against carbachol induced inhibition of electrically stimulated guinea pig atria Muscarinic acetylcholine receptor
J Med Chem 32: 79-84 (1989)
BindingDB Entry DOI: 10.7270/Q2N017RN
Muscarinic acetylcholine receptor M3
(Cavia porcellus)
BDBM50405757
(CHEMBL168786)
Show SMILES COc1ccccc1CNCCCCCCNCCCCCCCCCCCCCNCCCCCCNCc1ccccc1OC
Show InChI InChI=1S/C41H72N4O2/c1-46-40-28-18-16-26-38(40)36-44-34-24-14-12-22-32-42-30-20-10-8-6-4-3-5-7-9-11-21-31-43-33-23-13-15-25-35-45-37-39-27-17-19-29-41(39)47-2/h16-19,26-29,42-45H,3-15,20-25,30-37H2,1-2H3
Reactome pathway
n/an/an/a 1.23E+3n/an/an/an/an/a
University of Camerino
Curated by ChEMBL
Assay Description
Antagonist potency against carbachol induced contractions of isolated guinea pig ileum Muscarinic acetylcholine receptor
J Med Chem 32: 79-84 (1989)
BindingDB Entry DOI: 10.7270/Q2N017RN