null
SMILES: CN(C)C(=O)Oc1ccc2nc(sc2c1)S(N)(=O)=O
InChI Key: InChIKey=FQLWDWHCKHGESF-UHFFFAOYSA-N
Activity Spreadsheet -- Enzyme Inhibition Constant Data from BindingDB
Found 1 hit for monomerid = 50405854
Trg + Lig
Ki
nM
ΔG°
kcal/mole
IC50
nM
Kd
nM
EC50/IC50
nM
koff
s-1
kon
M-1s-1
pHTemp
°C
Carbonic anhydrase 2
(Homo sapiens (Human))
BDBM50405854
(CHEMBL311904)
Show SMILES CN(C)C(=O)Oc1ccc2nc(sc2c1)S(N)(=O)=O
Show InChI InChI=1S/C10H11N3O4S2/c1-13(2)10(14)17-6-3-4-7-8(5-6)18-9(12-7)19(11,15)16/h3-5H,1-2H3,(H2,11,15,16)
Reactome pathway
n/an/a 1.60n/an/an/an/an/an/a
Merck Sharp& Dohme Research Laboratory
Curated by ChEMBL
Assay Description
In vitro inhibition of human Carbonic Anhydrase II
J Med Chem 32: 2486-92 (1989)
BindingDB Entry DOI: 10.7270/Q27P90KQ