null
SMILES: CC(C)(C)OC(=O)Oc1ccc2nc(sc2c1)S(N)(=O)=O
InChI Key: InChIKey=QCJDAWQKVVBUEB-UHFFFAOYSA-N
Activity Spreadsheet -- Enzyme Inhibition Constant Data from BindingDB
Found 1 hit for monomerid = 50405855
Trg + Lig
Ki
nM
ΔG°
kcal/mole
IC50
nM
Kd
nM
EC50/IC50
nM
koff
s-1
kon
M-1s-1
pHTemp
°C
Carbonic anhydrase 2
(Homo sapiens (Human))
BDBM50405855
(CHEMBL310291)
Show SMILES CC(C)(C)OC(=O)Oc1ccc2nc(sc2c1)S(N)(=O)=O
Show InChI InChI=1S/C12H14N2O5S2/c1-12(2,3)19-11(15)18-7-4-5-8-9(6-7)20-10(14-8)21(13,16)17/h4-6H,1-3H3,(H2,13,16,17)
Reactome pathway
n/an/a 10n/an/an/an/an/an/a
Merck Sharp& Dohme Research Laboratory
Curated by ChEMBL
Assay Description
In vitro inhibition of human Carbonic Anhydrase II
J Med Chem 32: 2486-92 (1989)
BindingDB Entry DOI: 10.7270/Q27P90KQ