BDBM50406198 CHEMBL145035
SMILES: CC(C)COC(=O)N(C)c1nc2ccccc2c(=O)o1
InChI Key: InChIKey=HTVAQWWUWWYKIY-UHFFFAOYSA-N
Data: 1 KI  1 Koff  1 Kon
Activity Spreadsheet -- Enzyme Inhibition Constant Data from BindingDB
Found 1 hit for monomerid = 50406198
Trg + Lig
Ki
nM
ΔG°
kcal/mole
IC50
nM
Kd
nM
EC50/IC50
nM
koff
s-1
kon
M-1s-1
pHTemp
°C
Leukocyte elastase
(Homo sapiens (Human))
BDBM50406198
(CHEMBL145035)
Show SMILES CC(C)COC(=O)N(C)c1nc2ccccc2c(=O)o1
Show InChI InChI=1S/C14H16N2O4/c1-9(2)8-19-14(18)16(3)13-15-11-7-5-4-6-10(11)12(17)20-13/h4-7,9H,8H2,1-3H3
Reactome pathway
2.51n/an/an/an/a 0.000813 3.02E+5n/an/a
Syntex Research
Curated by ChEMBL
Assay Description
Component deacylation rate constant for interaction with human leukocyte elastase
J Med Chem 33: 464-79 (1990)
Checked by Author
BindingDB Entry DOI: 10.7270/Q2PR7X6X