BDBM50406206 CHEMBL145152
SMILES: CC(C)Nc1nc2cc(N)cc(C)c2c(=O)o1
InChI Key: InChIKey=ADIOVGWIANADRA-UHFFFAOYSA-N
Data: 1 KI  1 Koff  1 Kon
Activity Spreadsheet -- Enzyme Inhibition Constant Data from BindingDB
Found 1 hit for monomerid = 50406206
Trg + Lig
Ki
nM
ΔG°
kcal/mole
IC50
nM
Kd
nM
EC50/IC50
nM
koff
s-1
kon
M-1s-1
pHTemp
°C
Leukocyte elastase
(Homo sapiens (Human))
BDBM50406206
(CHEMBL145152)
Show SMILES CC(C)Nc1nc2cc(N)cc(C)c2c(=O)o1
Show InChI InChI=1S/C12H15N3O2/c1-6(2)14-12-15-9-5-8(13)4-7(3)10(9)11(16)17-12/h4-6H,13H2,1-3H3,(H,14,15)
Reactome pathway
79.4n/an/an/an/a 0.0000178 229n/an/a
Syntex Research
Curated by ChEMBL
Assay Description
Component deacylation rate constant for interaction with human leukocyte elastase
J Med Chem 33: 464-79 (1990)
Checked by Author
BindingDB Entry DOI: 10.7270/Q2PR7X6X