BDBM50406223 CHEMBL143922
SMILES: CSc1nc2ccccc2c(=O)o1
InChI Key: InChIKey=KFSXSHARFWOYTD-UHFFFAOYSA-N
Data: 1 KI  1 Koff  1 Kon
Activity Spreadsheet -- Enzyme Inhibition Constant Data from BindingDB
Found 1 hit for monomerid = 50406223
Trg + Lig
Ki
nM
ΔG°
kcal/mole
IC50
nM
Kd
nM
EC50/IC50
nM
koff
s-1
kon
M-1s-1
pHTemp
°C
Leukocyte elastase
(Homo sapiens (Human))
BDBM50406223
(CHEMBL143922)
Show SMILES CSc1nc2ccccc2c(=O)o1
Show InChI InChI=1S/C9H7NO2S/c1-13-9-10-7-5-3-2-4-6(7)8(11)12-9/h2-5H,1H3
Reactome pathway
19.9n/an/an/an/a 0.00724 3.47E+5n/an/a
Syntex Research
Curated by ChEMBL
Assay Description
Component deacylation rate constant for interaction with human leukocyte elastase
J Med Chem 33: 464-79 (1990)
Checked by Author
BindingDB Entry DOI: 10.7270/Q2PR7X6X