BDBM50406496 CHEMBL2079551
SMILES: CSCC[C@H](NC(=O)[C@H](Cc1ccc(Cc2nnn[nH]2)cc1)NC(C)=O)C(=O)NCC(=O)N[C@@H](Cc1c[nH]c2ccccc12)C(=O)N[C@@H](CCSC)C(=O)N[C@@H](CC(O)=O)C(=O)N[C@@H](Cc1ccccc1)C(N)=O
InChI Key: InChIKey=JGKCWFOANMYOKQ-UNHORJANSA-N
Data: 2 IC50
Activity Spreadsheet -- Enzyme Inhibition Constant Data from BindingDB
Found 2 hits for monomerid = 50406496
Trg + Lig
Ki
nM
ΔG°
kcal/mole
IC50
nM
Kd
nM
EC50/IC50
nM
koff
s-1
kon
M-1s-1
pHTemp
°C
Cholecystokinin B receptor
(Bos taurus)
BDBM50406496
(CHEMBL2079551)
Show SMILES CSCC[C@H](NC(=O)[C@H](Cc1ccc(Cc2nnn[nH]2)cc1)NC(C)=O)C(=O)NCC(=O)N[C@@H](Cc1c[nH]c2ccccc12)C(=O)N[C@@H](CCSC)C(=O)N[C@@H](CC(O)=O)C(=O)N[C@@H](Cc1ccccc1)C(N)=O
Show InChI InChI=1S/C49H61N13O10S2/c1-28(63)53-38(22-30-13-15-31(16-14-30)23-41-59-61-62-60-41)47(70)55-35(17-19-73-2)45(68)52-27-42(64)54-39(24-32-26-51-34-12-8-7-11-33(32)34)48(71)56-36(18-20-74-3)46(69)58-40(25-43(65)66)49(72)57-37(44(50)67)21-29-9-5-4-6-10-29/h4-16,26,35-40,51H,17-25,27H2,1-3H3,(H2,50,67)(H,52,68)(H,53,63)(H,54,64)(H,55,70)(H,56,71)(H,57,72)(H,58,69)(H,65,66)(H,59,60,61,62)/t35-,36-,37-,38-,39-,40-/m0/s1
Reactome pathway
n/an/a 18n/an/an/an/an/an/a
Roche Research Center
Curated by ChEMBL
Assay Description
Inhibition of [3H]-propanoyl binding to cholecystokinin type B receptor subtype was determined in bovine striatum membranes
J Med Chem 34: 1125-36 (1991)
BindingDB Entry DOI: 10.7270/Q27P8XCT
Cholecystokinin receptor
(RAT)
BDBM50406496
(CHEMBL2079551)
Show SMILES CSCC[C@H](NC(=O)[C@H](Cc1ccc(Cc2nnn[nH]2)cc1)NC(C)=O)C(=O)NCC(=O)N[C@@H](Cc1c[nH]c2ccccc12)C(=O)N[C@@H](CCSC)C(=O)N[C@@H](CC(O)=O)C(=O)N[C@@H](Cc1ccccc1)C(N)=O
Show InChI InChI=1S/C49H61N13O10S2/c1-28(63)53-38(22-30-13-15-31(16-14-30)23-41-59-61-62-60-41)47(70)55-35(17-19-73-2)45(68)52-27-42(64)54-39(24-32-26-51-34-12-8-7-11-33(32)34)48(71)56-36(18-20-74-3)46(69)58-40(25-43(65)66)49(72)57-37(44(50)67)21-29-9-5-4-6-10-29/h4-16,26,35-40,51H,17-25,27H2,1-3H3,(H2,50,67)(H,52,68)(H,53,63)(H,54,64)(H,55,70)(H,56,71)(H,57,72)(H,58,69)(H,65,66)(H,59,60,61,62)/t35-,36-,37-,38-,39-,40-/m0/s1
Reactome pathway
n/an/a 67n/an/an/an/an/an/a
Roche Research Center
Curated by ChEMBL
Assay Description
Inhibition of [3H]-propanoyl binding to cholecystokinin type A receptor was determined in fresh rat pancreatic tissue membranes
J Med Chem 34: 1125-36 (1991)
BindingDB Entry DOI: 10.7270/Q27P8XCT