BDBM50406527 CHEMBL423660
SMILES: CCC(CC)NC=Nc1ccc(cc1)-c1c[nH]cn1
InChI Key: InChIKey=RBJNPHNTTPZWAB-UHFFFAOYSA-N
Data: 1 Kd
Activity Spreadsheet -- Enzyme Inhibition Constant Data from BindingDB
Found 1 hit for monomerid = 50406527
Trg + Lig
Ki
nM
ΔG°
kcal/mole
IC50
nM
Kd
nM
EC50/IC50
nM
koff
s-1
kon
M-1s-1
pHTemp
°C
Histamine H2 receptor
(Cavia porcellus (domestic guinea pig))
BDBM50406527
(CHEMBL423660)
Show SMILES CCC(CC)NC=Nc1ccc(cc1)-c1c[nH]cn1 |w:6.5|
Show InChI InChI=1S/C15H20N4/c1-3-13(4-2)17-11-18-14-7-5-12(6-8-14)15-9-16-10-19-15/h5-11,13H,3-4H2,1-2H3,(H,16,19)(H,17,18)
n/an/an/a 31.6n/an/an/an/an/a
Research Laboratories of Istituto De Angeli
Curated by ChEMBL
Assay Description
Histamine H2 receptor antagonism on the right atrium of the guinea pig
J Med Chem 34: 1772-6 (1991)
BindingDB Entry DOI: 10.7270/Q2W95BCR