BDBM50406531 CHEMBL296826
SMILES: CCNC=Nc1ccc(cc1)-c1c[nH]cn1
InChI Key: InChIKey=WPRKRUJEGXRIQE-UHFFFAOYSA-N
Data: 1 Kd
Activity Spreadsheet -- Enzyme Inhibition Constant Data from BindingDB
Found 1 hit for monomerid = 50406531
Trg + Lig
Ki
nM
ΔG°
kcal/mole
IC50
nM
Kd
nM
EC50/IC50
nM
koff
s-1
kon
M-1s-1
pHTemp
°C
Histamine H2 receptor
(Cavia porcellus (domestic guinea pig))
BDBM50406531
(CHEMBL296826)
Show SMILES CCNC=Nc1ccc(cc1)-c1c[nH]cn1 |w:3.2|
Show InChI InChI=1S/C12H14N4/c1-2-13-8-15-11-5-3-10(4-6-11)12-7-14-9-16-12/h3-9H,2H2,1H3,(H,13,15)(H,14,16)
n/an/an/a 42.7n/an/an/an/an/a
Research Laboratories of Istituto De Angeli
Curated by ChEMBL
Assay Description
Histamine H2 receptor antagonism on the right atrium of the guinea pig
J Med Chem 34: 1772-6 (1991)
BindingDB Entry DOI: 10.7270/Q2W95BCR