BDBM50406648 CHEMBL82654
SMILES: CC(C)NC(=O)NCCCOc1cccc(CN2CCCCC2)c1
InChI Key: InChIKey=MGZIWRVMBIZRMM-UHFFFAOYSA-N
Data: 1 Kd
Activity Spreadsheet -- Enzyme Inhibition Constant Data from BindingDB
Found 1 hit for monomerid = 50406648
Trg + Lig
Ki
nM
ΔG°
kcal/mole
IC50
nM
Kd
nM
EC50/IC50
nM
koff
s-1
kon
M-1s-1
pHTemp
°C
Histamine H2 receptor
(Cavia porcellus (domestic guinea pig))
BDBM50406648
(CHEMBL82654)
Show SMILES CC(C)NC(=O)NCCCOc1cccc(CN2CCCCC2)c1
Show InChI InChI=1S/C19H31N3O2/c1-16(2)21-19(23)20-10-7-13-24-18-9-6-8-17(14-18)15-22-11-4-3-5-12-22/h6,8-9,14,16H,3-5,7,10-13,15H2,1-2H3,(H2,20,21,23)
n/an/an/a 43.6n/an/an/an/an/a
Kyorin Pharmaceutical Company, Ltd.
Curated by ChEMBL
Assay Description
In vitro inhibitory activity against histamine H2-receptor in isolated Guinea pig right atria.
J Med Chem 35: 2446-51 (1992)
BindingDB Entry DOI: 10.7270/Q2V9898T