BDBM50406674 CHEMBL82599
SMILES: CCCNC(=O)NCCCOc1cccc(CN2CCCCC2)c1
InChI Key: InChIKey=MDMJQHWOYDAGNN-UHFFFAOYSA-N
Data: 1 Kd
Activity Spreadsheet -- Enzyme Inhibition Constant Data from BindingDB
Found 1 hit for monomerid = 50406674
Trg + Lig
Ki
nM
ΔG°
kcal/mole
IC50
nM
Kd
nM
EC50/IC50
nM
koff
s-1
kon
M-1s-1
pHTemp
°C
Histamine H2 receptor
(Cavia porcellus (domestic guinea pig))
BDBM50406674
(CHEMBL82599)
Show SMILES CCCNC(=O)NCCCOc1cccc(CN2CCCCC2)c1
Show InChI InChI=1S/C19H31N3O2/c1-2-10-20-19(23)21-11-7-14-24-18-9-6-8-17(15-18)16-22-12-4-3-5-13-22/h6,8-9,15H,2-5,7,10-14,16H2,1H3,(H2,20,21,23)
n/an/an/a 97.7n/an/an/an/an/a
Kyorin Pharmaceutical Company, Ltd.
Curated by ChEMBL
Assay Description
In vitro inhibitory activity against histamine H2-receptor in isolated Guinea pig right atria.
J Med Chem 35: 2446-51 (1992)
BindingDB Entry DOI: 10.7270/Q2V9898T