BDBM50406754 CHEMBL37629
SMILES: NCCc1c[nH]c2ccc(CCCc3nc(Cc4ccccc4)no3)cc12
InChI Key: InChIKey=JTBDYCCVUAQYMO-UHFFFAOYSA-N
Data: 1 IC50
Activity Spreadsheet -- Enzyme Inhibition Constant Data from BindingDB
Found 1 hit for monomerid = 50406754
Trg + Lig
Ki
nM
ΔG°
kcal/mole
IC50
nM
Kd
nM
EC50/IC50
nM
koff
s-1
kon
M-1s-1
pHTemp
°C
Serotonin 1d (5-HT1d) receptor
(Sus scrofa)
BDBM50406754
(CHEMBL37629)
Show SMILES NCCc1c[nH]c2ccc(CCCc3nc(Cc4ccccc4)no3)cc12
Show InChI InChI=1S/C22H24N4O/c23-12-11-18-15-24-20-10-9-17(13-19(18)20)7-4-8-22-25-21(26-27-22)14-16-5-2-1-3-6-16/h1-3,5-6,9-10,13,15,24H,4,7-8,11-12,14,23H2
n/an/a 1.60n/an/an/an/an/an/a
Merck Sharp and Dohme Research Laboratories
Curated by ChEMBL
Assay Description
Displacement of radioligand [3H]5-HT binding to 5-hydroxytryptamine 1D receptor in pig caudate membrane
J Med Chem 36: 1529-38 (1993)
BindingDB Entry DOI: 10.7270/Q22V2HB9