BDBM50406775 CHEMBL290171
SMILES: NCCc1c[nH]c2ccc(Cc3nc(no3)-c3ccccc3)cc12
InChI Key: InChIKey=DUCJXOYLGYOOQB-UHFFFAOYSA-N
Data: 1 IC50
Activity Spreadsheet -- Enzyme Inhibition Constant Data from BindingDB
Found 1 hit for monomerid = 50406775
Trg + Lig
Ki
nM
ΔG°
kcal/mole
IC50
nM
Kd
nM
EC50/IC50
nM
koff
s-1
kon
M-1s-1
pHTemp
°C
Serotonin 1d (5-HT1d) receptor
(Sus scrofa)
BDBM50406775
(CHEMBL290171)
Show SMILES NCCc1c[nH]c2ccc(Cc3nc(no3)-c3ccccc3)cc12
Show InChI InChI=1S/C19H18N4O/c20-9-8-15-12-21-17-7-6-13(10-16(15)17)11-18-22-19(23-24-18)14-4-2-1-3-5-14/h1-7,10,12,21H,8-9,11,20H2
n/an/a 20n/an/an/an/an/an/a
Merck Sharp and Dohme Research Laboratories
Curated by ChEMBL
Assay Description
Displacement of radioligand [3H]5-HT binding to 5-hydroxytryptamine 1D receptor in pig caudate membrane
J Med Chem 36: 1529-38 (1993)
BindingDB Entry DOI: 10.7270/Q22V2HB9