BDBM50406784 CHEMBL289354
SMILES: CCc1noc(n1)-c1ccc2[nH]cc(CCN)c2c1
InChI Key: InChIKey=RGZGVSMFNKBYQY-UHFFFAOYSA-N
Data: 1 IC50
Activity Spreadsheet -- Enzyme Inhibition Constant Data from BindingDB
Found 1 hit for monomerid = 50406784
Trg + Lig
Ki
nM
ΔG°
kcal/mole
IC50
nM
Kd
nM
EC50/IC50
nM
koff
s-1
kon
M-1s-1
pHTemp
°C
Serotonin 1d (5-HT1d) receptor
(Sus scrofa)
BDBM50406784
(CHEMBL289354)
Show SMILES CCc1noc(n1)-c1ccc2[nH]cc(CCN)c2c1
Show InChI InChI=1S/C14H16N4O/c1-2-13-17-14(19-18-13)9-3-4-12-11(7-9)10(5-6-15)8-16-12/h3-4,7-8,16H,2,5-6,15H2,1H3
n/an/a 13n/an/an/an/an/an/a
Merck Sharp and Dohme Research Laboratories
Curated by ChEMBL
Assay Description
Displacement of radioligand [3H]5-HT binding to 5-hydroxytryptamine 1D receptor in pig caudate membrane
J Med Chem 36: 1529-38 (1993)
BindingDB Entry DOI: 10.7270/Q22V2HB9