BDBM50407257 CHEMBL2112601
SMILES: CC(C)(C)NC(=O)[C@@H]1CN(CCN1C[C@@H](O)CNC(=O)[C@@H]1N[C@H](SC1(C)C)C(NC(=O)Cc1ccccc1)C(=O)NCc1ccccc1)C(=O)Oc1ccccc1
InChI Key: InChIKey=HMACMNCGIOXMMG-UXKRMTPHSA-N
Data: 1 IC50
Activity Spreadsheet -- Enzyme Inhibition Constant Data from BindingDB
Found 1 hit for monomerid = 50407257
Trg + Lig
Ki
nM
ΔG°
kcal/mole
IC50
nM
Kd
nM
EC50/IC50
nM
koff
s-1
kon
M-1s-1
pHTemp
°C
Human immunodeficiency virus type 1 protease
(Human immunodeficiency virus type 1)
BDBM50407257
(CHEMBL2112601)
Show SMILES CC(C)(C)NC(=O)[C@@H]1CN(CCN1C[C@@H](O)CNC(=O)[C@@H]1N[C@H](SC1(C)C)C(NC(=O)Cc1ccccc1)C(=O)NCc1ccccc1)C(=O)Oc1ccccc1
Show InChI InChI=1S/C42H55N7O7S/c1-41(2,3)47-36(52)32-27-49(40(55)56-31-19-13-8-14-20-31)22-21-48(32)26-30(50)25-44-38(54)35-42(4,5)57-39(46-35)34(37(53)43-24-29-17-11-7-12-18-29)45-33(51)23-28-15-9-6-10-16-28/h6-20,30,32,34-35,39,46,50H,21-27H2,1-5H3,(H,43,53)(H,44,54)(H,45,51)(H,47,52)/t30-,32-,34?,35-,39+/m0/s1
n/an/a 58n/an/an/an/an/an/a
Glaxo Research and Development Limited
Curated by ChEMBL
Assay Description
In vitro inhibitory activity against HIV proteinase
J Med Chem 37: 3707-16 (1994)
BindingDB Entry DOI: 10.7270/Q2V40T88