BDBM50407455 CHEMBL90670
SMILES: N[C@@H](CCC(N)=O)C(=O)NCC(O)=O
InChI Key: InChIKey=JEFZIKRIDLHOIF-BYPYZUCNSA-N
Data: 1 IC50
Activity Spreadsheet -- Enzyme Inhibition Constant Data from BindingDB
Found 1 hit for monomerid = 50407455
Trg + Lig
Ki
nM
ΔG°
kcal/mole
IC50
nM
Kd
nM
EC50/IC50
nM
koff
s-1
kon
M-1s-1
pHTemp
°C
Angiotensin-converting enzyme
(Homo sapiens (Human))
BDBM50407455
(CHEMBL90670)
Show SMILES N[C@@H](CCC(N)=O)C(=O)NCC(O)=O
Show InChI InChI=1S/C7H13N3O4/c8-4(1-2-5(9)11)7(14)10-3-6(12)13/h4H,1-3,8H2,(H2,9,11)(H,10,14)(H,12,13)/t4-/m0/s1
Reactome pathway
n/an/a 7.41E+6n/an/an/an/an/an/a
University of Illinois at Chicago
Curated by ChEMBL
Assay Description
Biological activity was measured against Angiotensin I converting enzyme
J Med Chem 38: 2705-13 (1995)
BindingDB Entry DOI: 10.7270/Q2GX4CSN