BDBM50407529 CHEMBL2113389
SMILES: OC[C@H]1O[C@H]([C@H](O)[C@@H]1O)n1cnc2c(NC3CCCC3)ccnc12
InChI Key: InChIKey=YBZHWDBTBCHQTH-XKVFNRALSA-N
Data: 3 KI  1 IC50  1 EC50
Activity Spreadsheet -- Enzyme Inhibition Constant Data from BindingDB
Found 5 hits for monomerid = 50407529
Trg + Lig
Ki
nM
ΔG°
kcal/mole
IC50
nM
Kd
nM
EC50/IC50
nM
koff
s-1
kon
M-1s-1
pHTemp
°C
Adenosine receptor
(Rattus norvegicus (rat))
BDBM50407529
(CHEMBL2113389)
Show SMILES OC[C@H]1O[C@H]([C@H](O)[C@@H]1O)n1cnc2c(NC3CCCC3)ccnc12 |r|
Show InChI InChI=1S/C16H22N4O4/c21-7-11-13(22)14(23)16(24-11)20-8-18-12-10(5-6-17-15(12)20)19-9-3-1-2-4-9/h5-6,8-9,11,13-14,16,21-23H,1-4,7H2,(H,17,19)/t11-,13-,14-,16-/m1/s1
Reactome pathway
7.5n/an/an/an/an/an/an/an/a
Universit£ di Camerino
Curated by ChEMBL
Assay Description
Displacement of [3H]PIA from adenosine A1 receptor of rat brain membranes
J Med Chem 31: 1179-83 (1988)
BindingDB Entry DOI: 10.7270/Q2QC042G
Adenosine A2 receptor
(Rattus norvegicus-Rattus norvegicus (rat))
BDBM50407529
(CHEMBL2113389)
Show SMILES OC[C@H]1O[C@H]([C@H](O)[C@@H]1O)n1cnc2c(NC3CCCC3)ccnc12 |r|
Show InChI InChI=1S/C16H22N4O4/c21-7-11-13(22)14(23)16(24-11)20-8-18-12-10(5-6-17-15(12)20)19-9-3-1-2-4-9/h5-6,8-9,11,13-14,16,21-23H,1-4,7H2,(H,17,19)/t11-,13-,14-,16-/m1/s1
1.76E+4n/an/an/an/an/an/an/an/a
Universit£ di Camerino
Curated by ChEMBL
Assay Description
Displacement of [3H]PIA from adenosine A1 receptor of rat brain membranes
J Med Chem 31: 1179-83 (1988)
BindingDB Entry DOI: 10.7270/Q2QC042G
Adenosine deaminase
(Bos taurus (bovine))
BDBM50407529
(CHEMBL2113389)
Show SMILES OC[C@H]1O[C@H]([C@H](O)[C@@H]1O)n1cnc2c(NC3CCCC3)ccnc12 |r|
Show InChI InChI=1S/C16H22N4O4/c21-7-11-13(22)14(23)16(24-11)20-8-18-12-10(5-6-17-15(12)20)19-9-3-1-2-4-9/h5-6,8-9,11,13-14,16,21-23H,1-4,7H2,(H,17,19)/t11-,13-,14-,16-/m1/s1
>1.00E+5n/an/an/an/an/an/an/an/a
Universit£ di Camerino
Curated by ChEMBL
Assay Description
Inhibition calf intestine adenosine deaminase
J Med Chem 38: 4019-25 (1995)
BindingDB Entry DOI: 10.7270/Q2RB757R
Adenosine receptor A1
(Rattus norvegicus (rat))
BDBM50407529
(CHEMBL2113389)
Show SMILES OC[C@H]1O[C@H]([C@H](O)[C@@H]1O)n1cnc2c(NC3CCCC3)ccnc12 |r|
Show InChI InChI=1S/C16H22N4O4/c21-7-11-13(22)14(23)16(24-11)20-8-18-12-10(5-6-17-15(12)20)19-9-3-1-2-4-9/h5-6,8-9,11,13-14,16,21-23H,1-4,7H2,(H,17,19)/t11-,13-,14-,16-/m1/s1
Reactome pathway
n/an/a 970n/an/an/an/an/an/a
Universit£ di Camerino
Curated by ChEMBL
Assay Description
Inhibition of Adenylate cyclase activity in rat fat cell membrane at adenosine A1 receptor
J Med Chem 31: 1179-83 (1988)
BindingDB Entry DOI: 10.7270/Q2QC042G
Adenosine A2 receptor
(Homo sapiens (Human))
BDBM50407529
(CHEMBL2113389)
Show SMILES OC[C@H]1O[C@H]([C@H](O)[C@@H]1O)n1cnc2c(NC3CCCC3)ccnc12 |r|
Show InChI InChI=1S/C16H22N4O4/c21-7-11-13(22)14(23)16(24-11)20-8-18-12-10(5-6-17-15(12)20)19-9-3-1-2-4-9/h5-6,8-9,11,13-14,16,21-23H,1-4,7H2,(H,17,19)/t11-,13-,14-,16-/m1/s1
n/an/an/an/a 2.60E+4n/an/an/an/a
Universit£ di Camerino
Curated by ChEMBL
Assay Description
Stimulation of adenylate cyclase activity in human platelet membrane at A2 receptor
J Med Chem 31: 1179-83 (1988)
BindingDB Entry DOI: 10.7270/Q2QC042G