BDBM50407740 CHEMBL2115334
SMILES: CN1c2ncc(Cl)cc2N(C2CC2)c2ncccc2C1=O
InChI Key: InChIKey=MNNLOWFHFHAOLD-UHFFFAOYSA-N
Data: 1 IC50
Activity Spreadsheet -- Enzyme Inhibition Constant Data from BindingDB
Found 1 hit for monomerid = 50407740
Trg + Lig
Ki
nM
ΔG°
kcal/mole
IC50
nM
Kd
nM
EC50/IC50
nM
koff
s-1
kon
M-1s-1
pHTemp
°C
Reverse transcriptase/RNaseH
(Human immunodeficiency virus 1)
BDBM50407740
(CHEMBL2115334)
Show SMILES CN1c2ncc(Cl)cc2N(C2CC2)c2ncccc2C1=O
Show InChI InChI=1S/C15H13ClN4O/c1-19-14-12(7-9(16)8-18-14)20(10-4-5-10)13-11(15(19)21)3-2-6-17-13/h2-3,6-8,10H,4-5H2,1H3
n/an/a 760n/an/an/an/an/an/a
Boehringer Ingelheim Pharmaceuticals
Curated by ChEMBL
Assay Description
In vitro for inhibition of HIV-1 reverse transcriptase.
J Med Chem 38: 1406-10 (1995)
BindingDB Entry DOI: 10.7270/Q2MG7NJQ