BDBM50407747 CHEMBL305041
SMILES: CCN1c2ncccc2N(C)C(=O)c2ccc(C)nc12
InChI Key: InChIKey=RNPIJLYEIKAEGF-UHFFFAOYSA-N
Data: 1 IC50
Activity Spreadsheet -- Enzyme Inhibition Constant Data from BindingDB
Found 1 hit for monomerid = 50407747
Trg + Lig
Ki
nM
ΔG°
kcal/mole
IC50
nM
Kd
nM
EC50/IC50
nM
koff
s-1
kon
M-1s-1
pHTemp
°C
Reverse transcriptase/RNaseH
(Human immunodeficiency virus 1)
BDBM50407747
(CHEMBL305041)
Show SMILES CCN1c2ncccc2N(C)C(=O)c2ccc(C)nc12
Show InChI InChI=1S/C15H16N4O/c1-4-19-13-11(8-7-10(2)17-13)15(20)18(3)12-6-5-9-16-14(12)19/h5-9H,4H2,1-3H3
n/an/a 1.00E+3n/an/an/an/an/an/a
Boehringer Ingelheim Pharmaceuticals
Curated by ChEMBL
Assay Description
In vitro for inhibition of HIV-1 reverse transcriptase.
J Med Chem 38: 1406-10 (1995)
BindingDB Entry DOI: 10.7270/Q2MG7NJQ