BDBM50408145 CHEMBL2114441
SMILES: CC(C)(C)c1cc2[C@H]3[C@@H](CCc4cc(O)c(O)cc34)NCc2s1
InChI Key: InChIKey=JRQAGZUTSLOUSW-ACJLOTCBSA-N
Data: 2 KI  1 EC50
Activity Spreadsheet -- Enzyme Inhibition Constant Data from BindingDB
Found 3 hits for monomerid = 50408145
Trg + Lig
Ki
nM
ΔG°
kcal/mole
IC50
nM
Kd
nM
EC50/IC50
nM
koff
s-1
kon
M-1s-1
pHTemp
°C
D(1A) dopamine receptor
(RAT)
BDBM50408145
(CHEMBL2114441)
Show SMILES CC(C)(C)c1cc2[C@H]3[C@@H](CCc4cc(O)c(O)cc34)NCc2s1
Show InChI InChI=1S/C19H23NO2S/c1-19(2,3)17-8-12-16(23-17)9-20-13-5-4-10-6-14(21)15(22)7-11(10)18(12)13/h6-8,13,18,20-22H,4-5,9H2,1-3H3/t13-,18+/m1/s1
6.60n/an/an/an/an/an/an/an/a
Abbott Laboratories
Curated by ChEMBL
Assay Description
In vitro binding affinity against Dopamine receptor D1 like from rat caudate membrane using [125I]-SCH as radioligand
J Med Chem 40: 1585-99 (1997)
Article DOI: 10.1021/jm970038v
BindingDB Entry DOI: 10.7270/Q2Z89D2B
D(2) dopamine receptor
(Rattus norvegicus (rat))
BDBM50408145
(CHEMBL2114441)
Show SMILES CC(C)(C)c1cc2[C@H]3[C@@H](CCc4cc(O)c(O)cc34)NCc2s1
Show InChI InChI=1S/C19H23NO2S/c1-19(2,3)17-8-12-16(23-17)9-20-13-5-4-10-6-14(21)15(22)7-11(10)18(12)13/h6-8,13,18,20-22H,4-5,9H2,1-3H3/t13-,18+/m1/s1
Reactome pathway
1.38E+3n/an/an/an/an/an/an/an/a
Abbott Laboratories
Curated by ChEMBL
Assay Description
In vitro binding affinity against Dopamine receptor D2 like from rat caudate membrane using [3H]-spiperone as radioligand
J Med Chem 40: 1585-99 (1997)
Article DOI: 10.1021/jm970038v
BindingDB Entry DOI: 10.7270/Q2Z89D2B
Dopamine D1 receptor
(Carassius auratus)
BDBM50408145
(CHEMBL2114441)
Show SMILES CC(C)(C)c1cc2[C@H]3[C@@H](CCc4cc(O)c(O)cc34)NCc2s1
Show InChI InChI=1S/C19H23NO2S/c1-19(2,3)17-8-12-16(23-17)9-20-13-5-4-10-6-14(21)15(22)7-11(10)18(12)13/h6-8,13,18,20-22H,4-5,9H2,1-3H3/t13-,18+/m1/s1
Reactome pathway
n/an/an/an/a 24n/an/an/an/a
Abbott Laboratories
Curated by ChEMBL
Assay Description
Ability to stimulate the Dopamine receptor D1 like was assayed by measuring cAMP production in cell free homogenates of goldfish retinal tissue
J Med Chem 40: 1585-99 (1997)
Article DOI: 10.1021/jm970038v
BindingDB Entry DOI: 10.7270/Q2Z89D2B