BDBM50408303 CHEMBL137665
SMILES: Brc1cc2Oc3cc(Br)c(Br)c(Br)c3Oc2cc1Br
InChI Key: InChIKey=ZIFMQFDZODRVTG-UHFFFAOYSA-N
Data: 1 EC50
Activity Spreadsheet -- Enzyme Inhibition Constant Data from BindingDB
Found 1 hit for monomerid = 50408303
Trg + Lig
Ki
nM
ΔG°
kcal/mole
IC50
nM
Kd
nM
EC50/IC50
nM
koff
s-1
kon
M-1s-1
pHTemp
°C
Aryl hydrocarbon receptor
(Homo sapiens (Human))
BDBM50408303
(CHEMBL137665)
Show SMILES Brc1cc2Oc3cc(Br)c(Br)c(Br)c3Oc2cc1Br
Show InChI InChI=1S/C12H3Br5O2/c13-4-1-7-8(2-5(4)14)19-12-9(18-7)3-6(15)10(16)11(12)17/h1-3H
n/an/an/an/a 6.61n/an/an/an/a
Harvard University
Curated by ChEMBL
Assay Description
Affinity on cytosolic Aromatic hydrocarbon receptor (Ah)
J Med Chem 40: 4360-71 (1998)
Article DOI: 10.1021/jm970488n
BindingDB Entry DOI: 10.7270/Q2BZ6784