BDBM50408804 CHEMBL410363
SMILES: CC[C@H](C)[C@H](NC(=O)[C@@H](Cc1ccc2ccccc2c1)NC(=O)[C@H](CO)NC(=O)[C@H](Cc1ccccc1)NC(=O)CNC(=O)[C@@H]1CCCN1C(=O)[C@@H]1CCCN1C(=O)[C@H](CCCNC(N)=N)NC(=O)[C@H](CCCCN)NC(C)=O)C(O)=O
InChI Key: InChIKey=DOSXOGUJJBDRGQ-VUBDHFCFSA-N
Data: 2 Kd
Activity Spreadsheet -- Enzyme Inhibition Constant Data from BindingDB
Found 2 hits for monomerid = 50408804
Trg + Lig
Ki
nM
ΔG°
kcal/mole
IC50
nM
Kd
nM
EC50/IC50
nM
koff
s-1
kon
M-1s-1
pHTemp
°C
BDKRB1
(RAT)
BDBM50408804
(CHEMBL410363)
Show SMILES CC[C@H](C)[C@H](NC(=O)[C@@H](Cc1ccc2ccccc2c1)NC(=O)[C@H](CO)NC(=O)[C@H](Cc1ccccc1)NC(=O)CNC(=O)[C@@H]1CCCN1C(=O)[C@@H]1CCCN1C(=O)[C@H](CCCNC(N)=N)NC(=O)[C@H](CCCCN)NC(C)=O)C(O)=O
Show InChI InChI=1S/C57H81N13O12/c1-4-34(2)48(56(81)82)68-51(76)43(31-37-23-24-38-17-8-9-18-39(38)29-37)66-52(77)44(33-71)67-50(75)42(30-36-15-6-5-7-16-36)64-47(73)32-62-53(78)45-21-13-27-69(45)55(80)46-22-14-28-70(46)54(79)41(20-12-26-61-57(59)60)65-49(74)40(63-35(3)72)19-10-11-25-58/h5-9,15-18,23-24,29,34,40-46,48,71H,4,10-14,19-22,25-28,30-33,58H2,1-3H3,(H,62,78)(H,63,72)(H,64,73)(H,65,74)(H,66,77)(H,67,75)(H,68,76)(H,81,82)(H4,59,60,61)/t34-,40-,41-,42-,43+,44-,45-,46-,48-/m0/s1
Reactome pathway
n/an/an/a 63.1n/an/an/an/an/a
Institute of Mutagenesis and Differentiation
Curated by ChEMBL
Assay Description
Antagonistic activity against Bradykinin receptor B1 of rat ileum longitudinal smooth muscle.
J Med Chem 42: 409-14 (1999)
Article DOI: 10.1021/jm980495r
BindingDB Entry DOI: 10.7270/Q25B03Q8
Bradykinin B2 receptor
(Cavia porcellus)
BDBM50408804
(CHEMBL410363)
Show SMILES CC[C@H](C)[C@H](NC(=O)[C@@H](Cc1ccc2ccccc2c1)NC(=O)[C@H](CO)NC(=O)[C@H](Cc1ccccc1)NC(=O)CNC(=O)[C@@H]1CCCN1C(=O)[C@@H]1CCCN1C(=O)[C@H](CCCNC(N)=N)NC(=O)[C@H](CCCCN)NC(C)=O)C(O)=O
Show InChI InChI=1S/C57H81N13O12/c1-4-34(2)48(56(81)82)68-51(76)43(31-37-23-24-38-17-8-9-18-39(38)29-37)66-52(77)44(33-71)67-50(75)42(30-36-15-6-5-7-16-36)64-47(73)32-62-53(78)45-21-13-27-69(45)55(80)46-22-14-28-70(46)54(79)41(20-12-26-61-57(59)60)65-49(74)40(63-35(3)72)19-10-11-25-58/h5-9,15-18,23-24,29,34,40-46,48,71H,4,10-14,19-22,25-28,30-33,58H2,1-3H3,(H,62,78)(H,63,72)(H,64,73)(H,65,74)(H,66,77)(H,67,75)(H,68,76)(H,81,82)(H4,59,60,61)/t34-,40-,41-,42-,43+,44-,45-,46-,48-/m0/s1
Reactome pathway
n/an/an/a 1.00E+3n/an/an/an/an/a
Institute of Mutagenesis and Differentiation
Curated by ChEMBL
Assay Description
Antagonistic activity against Bradykinin receptor B2 of guinea pig ileum longitudinal smooth muscle.
J Med Chem 42: 409-14 (1999)
Article DOI: 10.1021/jm980495r
BindingDB Entry DOI: 10.7270/Q25B03Q8