BDBM50408892 CHEMBL418118
SMILES: CCc1c(C)[nH]c(=O)c(NC(=O)CCCCCCCCCNC(=O)OC(C)(C)C)c1Cc1cc(C)cc(C)c1
InChI Key: InChIKey=FFQBLECKQNNFOG-UHFFFAOYSA-N
Data: 1 EC50
Activity Spreadsheet -- Enzyme Inhibition Constant Data from BindingDB
Found 1 hit for monomerid = 50408892
Trg + Lig
Ki
nM
ΔG°
kcal/mole
IC50
nM
Kd
nM
EC50/IC50
nM
koff
s-1
kon
M-1s-1
pHTemp
°C
Human immunodeficiency virus type 1 reverse transcriptase
(Human immunodeficiency virus 1)
BDBM50408892
(CHEMBL418118)
Show SMILES CCc1c(C)[nH]c(=O)c(NC(=O)CCCCCCCCCNC(=O)OC(C)(C)C)c1Cc1cc(C)cc(C)c1
Show InChI InChI=1S/C32H49N3O4/c1-8-26-24(4)34-30(37)29(27(26)21-25-19-22(2)18-23(3)20-25)35-28(36)16-14-12-10-9-11-13-15-17-33-31(38)39-32(5,6)7/h18-20H,8-17,21H2,1-7H3,(H,33,38)(H,34,37)(H,35,36)
n/an/an/an/a>1.00E+4n/an/an/an/a
UMR 176 CNRS/Institut Curie
Curated by ChEMBL
Assay Description
Effective concentration required to achieve 50% inhibition of HIV-1 LAI replication in human T4 lymphoblastoid CEM-SS cells.
J Med Chem 43: 1927-39 (2000)
BindingDB Entry DOI: 10.7270/Q2WS8VFT