BDBM50408896 CHEMBL56328
SMILES: CCOC(=O)CCn1c(=O)c(C)cn(C2CC(N=[N+]=[N-])C(CO)O2)c1=O
InChI Key: InChIKey=DPBMSGQYTGKICH-UHFFFAOYSA-N
Data: 1 EC50
Activity Spreadsheet -- Enzyme Inhibition Constant Data from BindingDB
Found 1 hit for monomerid = 50408896
Trg + Lig
Ki
nM
ΔG°
kcal/mole
IC50
nM
Kd
nM
EC50/IC50
nM
koff
s-1
kon
M-1s-1
pHTemp
°C
Human immunodeficiency virus type 1 reverse transcriptase
(Human immunodeficiency virus 1)
BDBM50408896
(CHEMBL56328)
Show SMILES CCOC(=O)CCn1c(=O)c(C)cn(C2CC(N=[N+]=[N-])C(CO)O2)c1=O
Show InChI InChI=1S/C15H21N5O6/c1-3-25-13(22)4-5-19-14(23)9(2)7-20(15(19)24)12-6-10(17-18-16)11(8-21)26-12/h7,10-12,21H,3-6,8H2,1-2H3
n/an/an/an/a 800n/an/an/an/a
UMR 176 CNRS/Institut Curie
Curated by ChEMBL
Assay Description
Effective concentration required to achieve 50% inhibition of HIV-1 LAI replication in human T4 lymphoblastoid CEM-SS cells.
J Med Chem 43: 1927-39 (2000)
BindingDB Entry DOI: 10.7270/Q2WS8VFT