BDBM50408963 CHEMBL322634
SMILES: CC(C)(C)OC(=O)N[C@@H](Cc1ccccc1)[C@@H](O)C[C@@H](Cc1c(F)c(F)c(F)c(F)c1F)C(=O)N[C@H]1[C@H](O)Cc2ccccc12
InChI Key: InChIKey=LUXWCCSCNDRTSF-NZNUERPMSA-N
Data: 1 IC50
Activity Spreadsheet -- Enzyme Inhibition Constant Data from BindingDB
Found 1 hit for monomerid = 50408963
Trg + Lig
Ki
nM
ΔG°
kcal/mole
IC50
nM
Kd
nM
EC50/IC50
nM
koff
s-1
kon
M-1s-1
pHTemp
°C
Human immunodeficiency virus type 1 protease
(Human immunodeficiency virus type 1)
BDBM50408963
(CHEMBL322634)
Show SMILES CC(C)(C)OC(=O)N[C@@H](Cc1ccccc1)[C@@H](O)C[C@@H](Cc1c(F)c(F)c(F)c(F)c1F)C(=O)N[C@H]1[C@H](O)Cc2ccccc12
Show InChI InChI=1S/C33H35F5N2O5/c1-33(2,3)45-32(44)39-22(13-17-9-5-4-6-10-17)23(41)16-19(14-21-25(34)27(36)29(38)28(37)26(21)35)31(43)40-30-20-12-8-7-11-18(20)15-24(30)42/h4-12,19,22-24,30,41-42H,13-16H2,1-3H3,(H,39,44)(H,40,43)/t19-,22+,23+,24-,30-/m1/s1
n/an/a 0.600n/an/an/an/an/an/a
Eli Lilly and Company
Curated by ChEMBL
Assay Description
Inhibitory activity against HIV-1 protease.
J Med Chem 43: 3020-32 (2000)
BindingDB Entry DOI: 10.7270/Q2HM59P2