BDBM50408987 CHEMBL318531
SMILES: CC(C)(C)OC(=O)N[C@@H](Cc1ccccc1)[C@@H](O)C[C@@H](Cc1ccc(O)cc1)C(=O)N[C@H]1[C@H](O)Cc2ccccc12
InChI Key: InChIKey=IXMOCJVKYIUCEJ-YXRRNMOASA-N
Data: 1 IC50
Activity Spreadsheet -- Enzyme Inhibition Constant Data from BindingDB
Found 1 hit for monomerid = 50408987
Trg + Lig
Ki
nM
ΔG°
kcal/mole
IC50
nM
Kd
nM
EC50/IC50
nM
koff
s-1
kon
M-1s-1
pHTemp
°C
Human immunodeficiency virus type 1 protease
(Human immunodeficiency virus type 1)
BDBM50408987
(CHEMBL318531)
Show SMILES CC(C)(C)OC(=O)N[C@@H](Cc1ccccc1)[C@@H](O)C[C@@H](Cc1ccc(O)cc1)C(=O)N[C@H]1[C@H](O)Cc2ccccc12
Show InChI InChI=1S/C33H40N2O6/c1-33(2,3)41-32(40)34-27(18-21-9-5-4-6-10-21)28(37)20-24(17-22-13-15-25(36)16-14-22)31(39)35-30-26-12-8-7-11-23(26)19-29(30)38/h4-16,24,27-30,36-38H,17-20H2,1-3H3,(H,34,40)(H,35,39)/t24-,27+,28+,29-,30-/m1/s1
n/an/a 0.160n/an/an/an/an/an/a
Eli Lilly and Company
Curated by ChEMBL
Assay Description
Inhibitory activity against HIV-1 protease.
J Med Chem 43: 3020-32 (2000)
BindingDB Entry DOI: 10.7270/Q2HM59P2