BDBM50409304 CHEMBL2113492
SMILES: CCCCCNC(=O)[C@H]1O[C@H]([C@H](O)[C@@H]1O)n1cnc2c(N)ncnc12
InChI Key: InChIKey=HPUURONQWKICJL-BQVMBELUSA-N
Data: 1 KI
Activity Spreadsheet -- Enzyme Inhibition Constant Data from BindingDB
Found 1 hit for monomerid = 50409304
Trg + Lig
Ki
nM
ΔG°
kcal/mole
IC50
nM
Kd
nM
EC50/IC50
nM
koff
s-1
kon
M-1s-1
pHTemp
°C
G protein-coupled receptor 80
(Rattus norvegicus)
BDBM50409304
(CHEMBL2113492)
Show SMILES CCCCCNC(=O)[C@H]1O[C@H]([C@H](O)[C@@H]1O)n1cnc2c(N)ncnc12 |r|
Show InChI InChI=1S/C15H22N6O4/c1-2-3-4-5-17-14(24)11-9(22)10(23)15(25-11)21-7-20-8-12(16)18-6-19-13(8)21/h6-7,9-11,15,22-23H,2-5H2,1H3,(H,17,24)(H2,16,18,19)/t9-,10+,11-,15+/m0/s1
Reactome pathway
12n/an/an/an/an/an/an/an/a
Hokkaido University
Curated by ChEMBL
Assay Description
Binding activity of P3 purinoceptor-like protein (P3LP) using radioligand 40 nM [3H]NECA from rat brain membranes
J Med Chem 44: 208-14 (2001)
BindingDB Entry DOI: 10.7270/Q2H41S5S