BDBM50409359 CHEMBL121646
SMILES: CSCC[C@H](NC(=O)[C@H](CC(C)C)NC(=O)[C@@H](N)Cc1ccc(O)cc1)C(=O)N1CCC[C@H]1C(=O)NCC(=O)N1CCC[C@H]1C(=O)N[C@@H](C(C)C)C(=O)N[C@@H]([C@@H](C)O)C(=O)N[C@@H](C(C)C)C(O)=O
InChI Key: InChIKey=ABAHBPDRGKVNFJ-VVBJDMAZSA-N
Data: 1 IC50
Activity Spreadsheet -- Enzyme Inhibition Constant Data from BindingDB
Found 1 hit for monomerid = 50409359
Trg + Lig
Ki
nM
ΔG°
kcal/mole
IC50
nM
Kd
nM
EC50/IC50
nM
koff
s-1
kon
M-1s-1
pHTemp
°C
HLA class I histocompatibility antigen A-3
(Homo sapiens (Human))
BDBM50409359
(CHEMBL121646)
Show SMILES CSCC[C@H](NC(=O)[C@H](CC(C)C)NC(=O)[C@@H](N)Cc1ccc(O)cc1)C(=O)N1CCC[C@H]1C(=O)NCC(=O)N1CCC[C@H]1C(=O)N[C@@H](C(C)C)C(=O)N[C@@H]([C@@H](C)O)C(=O)N[C@@H](C(C)C)C(O)=O
Show InChI InChI=1S/C46H73N9O12S/c1-24(2)21-32(50-39(59)30(47)22-28-13-15-29(57)16-14-28)40(60)49-31(17-20-68-8)45(65)55-19-10-11-33(55)41(61)48-23-35(58)54-18-9-12-34(54)42(62)51-36(25(3)4)43(63)53-38(27(7)56)44(64)52-37(26(5)6)46(66)67/h13-16,24-27,30-34,36-38,56-57H,9-12,17-23,47H2,1-8H3,(H,48,61)(H,49,60)(H,50,59)(H,51,62)(H,52,64)(H,53,63)(H,66,67)/t27-,30+,31+,32+,33+,34+,36+,37+,38+/m1/s1
Reactome pathway
n/an/a 11.7n/an/an/an/an/an/a
Edward Jenner Institute for Vaccine Research
Curated by ChEMBL
Assay Description
MHC class I HLA-A*0201 binding affinity assayed by based inhibition of binding of a radiolabeled standard peptide (FLPSDYFPSV)
J Med Chem 44: 3572-81 (2001)
BindingDB Entry DOI: 10.7270/Q23B61B5