BDBM50409364 CHEMBL214420
SMILES: CC[C@H](C)[C@H](NC(=O)[C@H](CC(C)C)NC(=O)[C@H](CS)NC(=O)[C@H](CC(C)C)NC(=O)[C@H](CC(C)C)NC(=O)[C@@H](N)CC(C)C)C(=O)N[C@@H](Cc1ccccc1)C(=O)N[C@@H](CC(C)C)C(=O)N[C@@H](CC(C)C)C(O)=O
InChI Key: InChIKey=MYAQIKZEVHULJE-QGYIIIHSSA-N
Data: 1 IC50
Activity Spreadsheet -- Enzyme Inhibition Constant Data from BindingDB
Found 1 hit for monomerid = 50409364
Trg + Lig
Ki
nM
ΔG°
kcal/mole
IC50
nM
Kd
nM
EC50/IC50
nM
koff
s-1
kon
M-1s-1
pHTemp
°C
HLA class I histocompatibility antigen A-3
(Homo sapiens (Human))
BDBM50409364
(CHEMBL214420)
Show SMILES CC[C@H](C)[C@H](NC(=O)[C@H](CC(C)C)NC(=O)[C@H](CS)NC(=O)[C@H](CC(C)C)NC(=O)[C@H](CC(C)C)NC(=O)[C@@H](N)CC(C)C)C(=O)N[C@@H](Cc1ccccc1)C(=O)N[C@@H](CC(C)C)C(=O)N[C@@H](CC(C)C)C(O)=O
Show InChI InChI=1S/C54H93N9O10S/c1-15-35(14)45(53(71)60-42(27-36-19-17-16-18-20-36)50(68)58-39(23-31(6)7)48(66)61-43(54(72)73)26-34(12)13)63-51(69)41(25-33(10)11)59-52(70)44(28-74)62-49(67)40(24-32(8)9)57-47(65)38(22-30(4)5)56-46(64)37(55)21-29(2)3/h16-20,29-35,37-45,74H,15,21-28,55H2,1-14H3,(H,56,64)(H,57,65)(H,58,68)(H,59,70)(H,60,71)(H,61,66)(H,62,67)(H,63,69)(H,72,73)/t35-,37-,38-,39-,40-,41-,42-,43-,44-,45-/m0/s1
Reactome pathway
n/an/a 26n/an/an/an/an/an/a
Edward Jenner Institute for Vaccine Research
Curated by ChEMBL
Assay Description
MHC class I HLA-A*0201 binding affinity assayed by based inhibition of binding of a radiolabeled standard peptide (FLPSDYFPSV)
J Med Chem 44: 3572-81 (2001)
BindingDB Entry DOI: 10.7270/Q23B61B5