BDBM50409656 CHEMBL150648
SMILES: CCCCCCC=CC(=O)C(F)(F)F
InChI Key: InChIKey=GBZCFQFQXMJNSG-UHFFFAOYSA-N
Data: 4 IC50
Activity Spreadsheet -- Enzyme Inhibition Constant Data from BindingDB
Found 4 hits for monomerid = 50409656
Trg + Lig
Ki
nM
ΔG°
kcal/mole
IC50
nM
Kd
nM
EC50/IC50
nM
koff
s-1
kon
M-1s-1
pHTemp
°C
Carboxylesterase
(Sus scrofa)
BDBM50409656
(CHEMBL150648)
Show SMILES CCCCCCC=CC(=O)C(F)(F)F |w:6.5|
Show InChI InChI=1S/C10H15F3O/c1-2-3-4-5-6-7-8-9(14)10(11,12)13/h7-8H,2-6H2,1H3
n/an/a 6.46E+6n/an/an/an/an/an/a
University of California
Curated by ChEMBL
Assay Description
In vitro inhibition of porcine carboxylesterase.
J Med Chem 45: 5576-93 (2002)
BindingDB Entry DOI: 10.7270/Q2DN4671
Carboxylesterase 2
(Homo sapiens (Human))
BDBM50409656
(CHEMBL150648)
Show SMILES CCCCCCC=CC(=O)C(F)(F)F |w:6.5|
Show InChI InChI=1S/C10H15F3O/c1-2-3-4-5-6-7-8-9(14)10(11,12)13/h7-8H,2-6H2,1H3
NCI pathway
n/an/a 9.33E+5n/an/an/an/an/an/a
University of California
Curated by ChEMBL
Assay Description
In vitro inhibition of carboxylesterase in human liver microsomes.
J Med Chem 45: 5576-93 (2002)
BindingDB Entry DOI: 10.7270/Q2DN4671
CG8425-PA [Drosophila melanogaster]
(Drosophila melanogaster)
BDBM50409656
(CHEMBL150648)
Show SMILES CCCCCCC=CC(=O)C(F)(F)F |w:6.5|
Show InChI InChI=1S/C10H15F3O/c1-2-3-4-5-6-7-8-9(14)10(11,12)13/h7-8H,2-6H2,1H3
n/an/a 7.94E+4n/an/an/an/an/an/a
University of California
Curated by ChEMBL
Assay Description
In vitro inhibition of Trichoplusia Juvenile Hormone Esterase.
J Med Chem 45: 5576-93 (2002)
BindingDB Entry DOI: 10.7270/Q2DN4671
Carboxylesterase 2
(Mus musculus)
BDBM50409656
(CHEMBL150648)
Show SMILES CCCCCCC=CC(=O)C(F)(F)F |w:6.5|
Show InChI InChI=1S/C10H15F3O/c1-2-3-4-5-6-7-8-9(14)10(11,12)13/h7-8H,2-6H2,1H3
n/an/a 1.48E+7n/an/an/an/an/an/a
University of California
Curated by ChEMBL
Assay Description
Inhibition of carboxylesterase in murine liver microsomes.
J Med Chem 45: 5576-93 (2002)
BindingDB Entry DOI: 10.7270/Q2DN4671