BDBM50409737 CHEMBL1161236
SMILES: [#6]-[#8]-c1cc(\[#6]=[#6](/C#N)C#N)cc(-[#16]-[#6]-[#6](-[#8])=O)c1-[#8]
InChI Key: InChIKey=PMVJTDWQYNWPQI-UHFFFAOYSA-N
Data: 2 IC50
Activity Spreadsheet -- Enzyme Inhibition Constant Data from BindingDB
Found 2 hits for monomerid = 50409737
Trg + Lig
Ki
nM
ΔG°
kcal/mole
IC50
nM
Kd
nM
EC50/IC50
nM
koff
s-1
kon
M-1s-1
pHTemp
°C
Epidermal growth factor receptor
(Homo sapiens (Human))
BDBM50409737
(CHEMBL1161236)
Show SMILES [#6]-[#8]-c1cc(\[#6]=[#6](/C#N)C#N)cc(-[#16]-[#6]-[#6](-[#8])=O)c1-[#8]
Show InChI InChI=1S/C13H10N2O4S/c1-19-10-3-8(2-9(5-14)6-15)4-11(13(10)18)20-7-12(16)17/h2-4,18H,7H2,1H3,(H,16,17)
n/an/a 5.37E+4n/an/an/an/an/an/a
University of Tennessee Health Sciences Center
Curated by ChEMBL
Assay Description
Inhibitory activity against epidermal growth factor receptor (EGFR)
J Med Chem 46: 4657-68 (2003)
Article DOI: 10.1021/jm030065n
BindingDB Entry DOI: 10.7270/Q2N58NKR
Receptor tyrosine-protein kinase erbB-2
(Homo sapiens (Human))
BDBM50409737
(CHEMBL1161236)
Show SMILES [#6]-[#8]-c1cc(\[#6]=[#6](/C#N)C#N)cc(-[#16]-[#6]-[#6](-[#8])=O)c1-[#8]
Show InChI InChI=1S/C13H10N2O4S/c1-19-10-3-8(2-9(5-14)6-15)4-11(13(10)18)20-7-12(16)17/h2-4,18H,7H2,1H3,(H,16,17)
n/an/a 4.57E+3n/an/an/an/an/an/a
University of Tennessee Health Sciences Center
Curated by ChEMBL
Assay Description
Inhibitory activity tested against protein kinase HER-2
J Med Chem 46: 4657-68 (2003)
Article DOI: 10.1021/jm030065n
BindingDB Entry DOI: 10.7270/Q2N58NKR