BDBM50409930 CHEMBL2021379
SMILES: Nc1nc2n(cnc2c(=O)[nH]1)[C@@H]1O[C@H](CO)[C@H](O)[C@H]1O
InChI Key: InChIKey=NYHBQMYGNKIUIF-FTWQFJAYSA-N
Data: 1 IC50  1 EC50
Activity Spreadsheet -- Enzyme Inhibition Constant Data from BindingDB
Found 2 hits for monomerid = 50409930
Trg + Lig
Ki
nM
ΔG°
kcal/mole
IC50
nM
Kd
nM
EC50/IC50
nM
koff
s-1
kon
M-1s-1
pHTemp
°C
Hepatitis C virus NS5B RNA-dependent RNA polymerase
(Hepatitis C virus)
BDBM50409930
(CHEMBL2021379)
Show SMILES Nc1nc2n(cnc2c(=O)[nH]1)[C@@H]1O[C@H](CO)[C@H](O)[C@H]1O |r|
Show InChI InChI=1S/C10H13N5O5/c11-10-13-7-4(8(19)14-10)12-2-15(7)9-6(18)5(17)3(1-16)20-9/h2-3,5-6,9,16-18H,1H2,(H3,11,13,14,19)/t3-,5+,6-,9-/m1/s1
n/an/a 2.00E+4n/an/an/an/an/an/a
Isis Pharmaceuticals
Curated by ChEMBL
Assay Description
Inhibition HCV NS5B-mediated RNA synthesis
J Med Chem 47: 2283-95 (2004)
Article DOI: 10.1021/jm030424e
BindingDB Entry DOI: 10.7270/Q2QZ2BQ3
Hepatitis C virus NS5B RNA-dependent RNA polymerase
(Hepatitis C virus)
BDBM50409930
(CHEMBL2021379)
Show SMILES Nc1nc2n(cnc2c(=O)[nH]1)[C@@H]1O[C@H](CO)[C@H](O)[C@H]1O |r|
Show InChI InChI=1S/C10H13N5O5/c11-10-13-7-4(8(19)14-10)12-2-15(7)9-6(18)5(17)3(1-16)20-9/h2-3,5-6,9,16-18H,1H2,(H3,11,13,14,19)/t3-,5+,6-,9-/m1/s1
n/an/an/an/a>5.00E+4n/an/an/an/a
Isis Pharmaceuticals
Curated by ChEMBL
Assay Description
Inhibition HCV RNA replication
J Med Chem 47: 2283-95 (2004)
Article DOI: 10.1021/jm030424e
BindingDB Entry DOI: 10.7270/Q2QZ2BQ3