BDBM50410048 CHEMBL434548
SMILES: OC1CCN(CC1)C1CN(CC[C@@]2(CCC(=O)N(CC3CCC(F)(F)CC3)C2)c2ccc(Cl)c(Cl)c2)C1
InChI Key: InChIKey=CATLUVQPBGZMNF-HHHXNRCGSA-N
Data: 1 IC50  1 Kd
Activity Spreadsheet -- Enzyme Inhibition Constant Data from BindingDB
Found 2 hits for monomerid = 50410048
Trg + Lig
Ki
nM
ΔG°
kcal/mole
IC50
nM
Kd
nM
EC50/IC50
nM
koff
s-1
kon
M-1s-1
pHTemp
°C
Neurokinin 2 receptor
(Oryctolagus cuniculus)
BDBM50410048
(CHEMBL434548)
Show SMILES OC1CCN(CC1)C1CN(CC[C@@]2(CCC(=O)N(CC3CCC(F)(F)CC3)C2)c2ccc(Cl)c(Cl)c2)C1
Show InChI InChI=1S/C28H39Cl2F2N3O2/c29-24-2-1-21(15-25(24)30)27(11-14-33-17-22(18-33)34-12-6-23(36)7-13-34)8-5-26(37)35(19-27)16-20-3-9-28(31,32)10-4-20/h1-2,15,20,22-23,36H,3-14,16-19H2/t27-/m1/s1
Reactome pathway
n/an/an/a 0.0794n/an/an/an/an/a
Pfizer Global Research and Development
Curated by ChEMBL
Assay Description
pA2 for NK2 receptor of rabbit pulmonary artery
Bioorg Med Chem Lett 15: 3957-61 (2005)
Article DOI: 10.1016/j.bmcl.2005.05.134
BindingDB Entry DOI: 10.7270/Q20G3JQM
Neurokinin 2 receptor
(Homo sapiens (Human))
BDBM50410048
(CHEMBL434548)
Show SMILES OC1CCN(CC1)C1CN(CC[C@@]2(CCC(=O)N(CC3CCC(F)(F)CC3)C2)c2ccc(Cl)c(Cl)c2)C1
Show InChI InChI=1S/C28H39Cl2F2N3O2/c29-24-2-1-21(15-25(24)30)27(11-14-33-17-22(18-33)34-12-6-23(36)7-13-34)8-5-26(37)35(19-27)16-20-3-9-28(31,32)10-4-20/h1-2,15,20,22-23,36H,3-14,16-19H2/t27-/m1/s1
Reactome pathway
n/an/a 1.30n/an/an/an/an/an/a
Pfizer Global Research and Development
Curated by ChEMBL
Assay Description
Inhibition of human Neurokinin 2 receptor
Bioorg Med Chem Lett 15: 3957-61 (2005)
Article DOI: 10.1016/j.bmcl.2005.05.134
BindingDB Entry DOI: 10.7270/Q20G3JQM