BDBM50410321 CHEMBL2113076
SMILES: Fc1ccc(C[C@@H]2CCCN(C[C@@H]3CCCC[C@H]3NC(=O)Nc3ccc4ncsc4c3)C2)cc1
InChI Key: InChIKey=GUTLQOKVJCDGEX-AWRGLXIESA-N
Data: 1 IC50
Activity Spreadsheet -- Enzyme Inhibition Constant Data from BindingDB
Found 1 hit for monomerid = 50410321
Trg + Lig
Ki
nM
ΔG°
kcal/mole
IC50
nM
Kd
nM
EC50/IC50
nM
koff
s-1
kon
M-1s-1
pHTemp
°C
C-C chemokine receptor type 3
(Homo sapiens (Human))
BDBM50410321
(CHEMBL2113076)
Show SMILES Fc1ccc(C[C@@H]2CCCN(C[C@@H]3CCCC[C@H]3NC(=O)Nc3ccc4ncsc4c3)C2)cc1
Show InChI InChI=1S/C27H33FN4OS/c28-22-9-7-19(8-10-22)14-20-4-3-13-32(16-20)17-21-5-1-2-6-24(21)31-27(33)30-23-11-12-25-26(15-23)34-18-29-25/h7-12,15,18,20-21,24H,1-6,13-14,16-17H2,(H2,30,31,33)/t20-,21-,24+/m0/s1
Reactome pathway
n/an/a 1.20n/an/an/an/an/an/a
Pharmaceutical Research Institute
Curated by ChEMBL
Assay Description
Inhibition of eotaxin-induced chemotaxis of human eosinophils
J Med Chem 48: 2194-211 (2005)
Article DOI: 10.1021/jm049530m
BindingDB Entry DOI: 10.7270/Q2XP74F1