BDBM50410354 CHEMBL195777
SMILES: Cc1ccc2nc(cn2c1)-c1ccc(OCCCN2CCCCC2)cc1
InChI Key: InChIKey=LFGAXDHNYKZHFI-UHFFFAOYSA-N
Data: 1 Kd
Activity Spreadsheet -- Enzyme Inhibition Constant Data from BindingDB
Found 1 hit for monomerid = 50410354
Trg + Lig
Ki
nM
ΔG°
kcal/mole
IC50
nM
Kd
nM
EC50/IC50
nM
koff
s-1
kon
M-1s-1
pHTemp
°C
Histamine H3 receptor
(Homo sapiens (Human))
BDBM50410354
(CHEMBL195777)
Show SMILES Cc1ccc2nc(cn2c1)-c1ccc(OCCCN2CCCCC2)cc1
Show InChI InChI=1S/C22H27N3O/c1-18-6-11-22-23-21(17-25(22)16-18)19-7-9-20(10-8-19)26-15-5-14-24-12-3-2-4-13-24/h6-11,16-17H,2-5,12-15H2,1H3
Reactome pathway
n/an/an/a 2.04n/an/an/an/an/a
Johnson& Johnson Pharmaceutical Research and Development
Curated by ChEMBL
Assay Description
Mean functional activity against human H3 receptor
J Med Chem 48: 2229-38 (2005)
Article DOI: 10.1021/jm049212n
BindingDB Entry DOI: 10.7270/Q2GB258T