BDBM50410558 CHEMBL199091
SMILES: OC(=O)c1cccc(NC(=O)c2[nH]c(nc2CCC23CC4CC(CC(C4)C2)C3)C23CCC(CC2)CC3)c1
InChI Key: InChIKey=BXSYWNFICYSSKM-UHFFFAOYSA-N
Data: 1 Kd
Activity Spreadsheet -- Enzyme Inhibition Constant Data from BindingDB
Found 1 hit for monomerid = 50410558
Trg + Lig
Ki
nM
ΔG°
kcal/mole
IC50
nM
Kd
nM
EC50/IC50
nM
koff
s-1
kon
M-1s-1
pHTemp
°C
CCKBR
(RAT)
BDBM50410558
(CHEMBL199091)
Show SMILES OC(=O)c1cccc(NC(=O)c2[nH]c(nc2CCC23CC4CC(CC(C4)C2)C3)C23CCC(CC2)CC3)c1 |TLB:25:20:27:24.26.23,25:24:27:20.19.21,21:22:26:20.19.25,THB:21:20:26:22.27.23,23:22:19:24.26.25,23:24:19:22.27.21|
Show InChI InChI=1S/C31H39N3O3/c35-27(32-24-3-1-2-23(15-24)28(36)37)26-25(33-29(34-26)31-9-4-19(5-10-31)6-11-31)7-8-30-16-20-12-21(17-30)14-22(13-20)18-30/h1-3,15,19-22H,4-14,16-18H2,(H,32,35)(H,33,34)(H,36,37)
n/an/an/a 2.45n/an/an/an/an/a
James Black Foundation
Curated by ChEMBL
Assay Description
Antagonist activity against CCK2 receptor estimated from single shifts of pentagastrin concentration-effect curves in the isolated rat stomach
J Med Chem 48: 6803-12 (2005)
Article DOI: 10.1021/jm0490686
BindingDB Entry DOI: 10.7270/Q2PV6MM7